{"text_format":"1","workbook":"xlsx","n_sheets":9,"sheets":["SIde by Side 1","Side by Side 2","Conditional Formatting 1","Conditional Formatting 2","Manage Rule","VLOOKUP 1","VLOOKUP 2","VBA 1","VBA 2"],"not_rendered":{"charts":0,"images":0,"macros":1,"external_links":0,"defined_names":0,"comments":0,"pivot_tables":0},"unopened":[],"bounds":{"document_bytes":16777216,"sheet_cells":100000,"rows_first":2000,"rows_last":500,"rows_between":2000,"halvings":0,"cell_chars":16384,"cell_head_chars":4096},"cells_cut":0,"cells_raw":0,"read":"whole","date_system":"1900"}

{"sheet":"SIde by Side 1","index":0,"n_rows":11,"n_cols":3,"rows_kept":11,"cut":false,"hidden":false,"merged":[[1,1,1,2]]}
[]
[null,"View Side by Side"]
[]
[null,"Day","Hours"]
[null,"Sat",8]
[null,"Sun",6]
[null,"Mon",5]
[null,"Tue",9]
[null,"Wed",5]
[null,"Thu",4]
[null,"Fri",2]

{"sheet":"Side by Side 2","index":1,"n_rows":11,"n_cols":3,"rows_kept":11,"cut":false,"hidden":false,"merged":[[1,1,1,2]]}
[]
[null,"View Side by Side"]
[]
[null,"Day","Hours"]
[null,"Sat",8]
[null,"Sun",11]
[null,"Mon",5]
[null,"Tue",9]
[null,"Wed",13]
[null,"Thu",4]
[null,"Fri",12]

{"sheet":"Conditional Formatting 1","index":2,"n_rows":11,"n_cols":11,"rows_kept":11,"cut":false,"hidden":false,"merged":[[1,9,1,10],[1,1,1,2]]}
[]
[null,"Use Conditional Formatting",null,null,null,null,null,null,null,"Do Yourself"]
[]
[null,"Day","Hours",null,null,null,null,null,null,"Day","Hours"]
[null,"Sat",8,null,null,null,null,null,null,"Sat",8]
[null,"Sun",7,null,null,null,null,null,null,"Sun",7]
[null,"Mon",5,null,null,null,null,null,null,"Mon",5]
[null,"Tue",9,null,null,null,null,null,null,"Tue",9]
[null,"Wed",6,null,null,null,null,null,null,"Wed",6]
[null,"Thu",3,null,null,null,null,null,null,"Thu",3]
[null,"Fri",2,null,null,null,null,null,null,"Fri",2]

{"sheet":"Conditional Formatting 2","index":3,"n_rows":11,"n_cols":3,"rows_kept":11,"cut":false,"hidden":false,"merged":[[1,1,1,2]]}
[]
[null,"Use Conditional Formatting"]
[]
[null,"Day","Hours"]
[null,"Sat",8]
[null,"Sun",6]
[null,"Mon",9]
[null,"Tue",9]
[null,"Wed",5]
[null,"Thu",4]
[null,"Fri",2]

{"sheet":"Manage Rule","index":4,"n_rows":11,"n_cols":11,"rows_kept":11,"cut":false,"hidden":false,"merged":[[1,1,1,2],[1,9,1,10]]}
[]
[null,"Use of Manage Rule",null,null,null,null,null,null,null,"Do Yourself"]
[]
[null,"Day","Hours",null,null,null,null,null,null,"Day","Hours"]
[null,"Sat",8,null,null,null,null,null,null,"Sat",8]
[null,"Sun",7,null,null,null,null,null,null,"Sun",7]
[null,"Mon",5,null,null,null,null,null,null,"Mon",5]
[null,"Tue",9,null,null,null,null,null,null,"Tue",9]
[null,"Wed",6,null,null,null,null,null,null,"Wed",6]
[null,"Thu",3,null,null,null,null,null,null,"Thu",3]
[null,"Fri",2,null,null,null,null,null,null,"Fri",2]

{"sheet":"VLOOKUP 1","index":5,"n_rows":10,"n_cols":12,"rows_kept":10,"cut":false,"hidden":false,"merged":[[1,9,1,11],[1,1,1,3]]}
[]
[null,"Employ VLOOKUP",null,null,null,null,null,null,null,">>> Do Yourself <<<"]
[]
[null,"ID No","Name","Salary",null,null,null,null,null,"ID No","Name","Salary"]
[null,110,"Ricky",{"$f":"IFERROR(VLOOKUP(B5,'VLOOKUP 2'!B5:C10,2,FALSE),\"Not Available\")","v":4000},null,null,null,null,null,110,"Ricky"]
[null,123,"Hank",{"$f":"IFERROR(VLOOKUP(B6,'VLOOKUP 2'!B6:C11,2,FALSE),\"Not Available\")","v":"Not Available"},null,null,null,null,null,123,"Hank"]
[null,141,"Frank",{"$f":"IFERROR(VLOOKUP(B7,'VLOOKUP 2'!B7:C12,2,FALSE),\"Not Available\")","v":2000},null,null,null,null,null,141,"Frank"]
[null,151,"Tom",{"$f":"IFERROR(VLOOKUP(B8,'VLOOKUP 2'!B8:C13,2,FALSE),\"Not Available\")","v":"Not Available"},null,null,null,null,null,151,"Tom"]
[null,166,"Rob",{"$f":"IFERROR(VLOOKUP(B9,'VLOOKUP 2'!B9:C14,2,FALSE),\"Not Available\")","v":2500},null,null,null,null,null,166,"Rob"]
[null,177,"Bob",{"$f":"IFERROR(VLOOKUP(B10,'VLOOKUP 2'!B10:C15,2,FALSE),\"Not Available\")","v":3500},null,null,null,null,null,177,"Bob"]

{"sheet":"VLOOKUP 2","index":6,"n_rows":10,"n_cols":3,"rows_kept":10,"cut":false,"hidden":false,"merged":[[1,1,1,2]]}
[]
[null,"Employee Data"]
[]
[null,"ID No","Salary"]
[null,110,4000]
[null,133,3000]
[null,141,2000]
[null,159,5000]
[null,166,2500]
[null,177,3500]

{"sheet":"VBA 1","index":7,"n_rows":11,"n_cols":3,"rows_kept":11,"cut":false,"hidden":false,"merged":[[1,1,1,2]]}
[]
[null,"Insert VBA"]
[]
[null,"Day","Hours"]
[null,"Sat",8]
[null,"Sun",6]
[null,"Mon",5]
[null,"Tue",9]
[null,"Wed",5]
[null,"Thu",4]
[null,"Fri",2]

{"sheet":"VBA 2","index":8,"n_rows":11,"n_cols":3,"rows_kept":11,"cut":false,"hidden":false,"merged":[[1,1,1,2]]}
[]
[null,"Insert VBA"]
[]
[null,"Day","Hours"]
[null,"Sat",8]
[null,"Sun",11]
[null,"Mon",5]
[null,"Tue",9]
[null,"Wed",13]
[null,"Thu",4]
[null,"Fri",12]