{"text_format":"1","workbook":"xlsx","n_sheets":6,"sheets":["Logo Selection","Image Sources","Image","Data-Source","Dashboard","VBA"],"not_rendered":{"charts":0,"images":10,"macros":1,"external_links":0,"defined_names":2,"comments":0,"pivot_tables":0},"unopened":[],"bounds":{"document_bytes":16777216,"sheet_cells":100000,"rows_first":2000,"rows_last":500,"rows_between":2000,"halvings":0,"cell_chars":16384,"cell_head_chars":4096},"cells_cut":0,"cells_raw":0,"read":"whole","date_system":"1900"}

{"sheet":"Logo Selection","index":0,"n_rows":10,"n_cols":8,"rows_kept":10,"cut":false,"hidden":false,"merged":[[1,1,1,2]]}
[]
[null,"Combining INDEX and MATCH Functions"]
[]
[null,"Logo Name","Exceldemy-logo-small"]
[]
[]
[]
[]
[]
[null,null,null,null,null,null,null,{"$f":"INDEX('Image Sources'!$C$5:$C$7,MATCH('Logo Selection'!$C$4,'Image Sources'!$B$5:$B$7,0))","v":0}]

{"sheet":"Image Sources","index":1,"n_rows":7,"n_cols":3,"rows_kept":7,"cut":false,"hidden":false,"merged":[[2,1,2,2],[1,1,1,2]]}
[]
[null,"Combining INDEX and MATCH Functions"]
[]
[null,"Logo Name","Logo"]
[null,"exceldemy-logo-diamond"]
[null,"Exceldemy-logo-small"]
[null,"Exceldemy-logo-old"]

{"sheet":"Image","index":2,"n_rows":7,"n_cols":7,"rows_kept":7,"cut":false,"hidden":false,"merged":[[1,1,1,2]]}
[null,null,null,null,null,null,1]
[null,"Using INDEX Function"]
[]
[null,"Person Name","Image"]
[null,"Bill Gates"]
[null,"Elon Musk"]
[null,"Sundar Pichai"]

{"sheet":"Data-Source","index":3,"n_rows":7,"n_cols":5,"rows_kept":7,"cut":false,"hidden":false,"merged":[[1,1,1,4]]}
[]
[null,"Using INDEX Function"]
[]
[null,"Persons Name","Age","Hometown","Country"]
[null,"Bill Gates",66,"Seattle","USA"]
[null,"Elon Musk",50,"Pretoria","South Africa"]
[null,"Sundar Pichai",50,"Chennai"," India"]

{"sheet":"Dashboard","index":4,"n_rows":8,"n_cols":3,"rows_kept":8,"cut":false,"hidden":false,"merged":[[1,1,1,2]]}
[]
[null,"Using INDEX Function"]
[]
[null,"Person Name","Bill Gates"]
[null,"Image"]
[null,"Age",{"$f":"VLOOKUP(C4,'Data-Source'!B5:E7,2,0)","v":66}]
[null,"Hometown",{"$f":"VLOOKUP(C4,'Data-Source'!B5:E7,3,0)","v":"Seattle"}]
[null,"Country",{"$f":"VLOOKUP(C4,'Data-Source'!B5:E7,4,0)","v":"USA"}]

{"sheet":"VBA","index":5,"n_rows":7,"n_cols":5,"rows_kept":7,"cut":false,"hidden":false,"merged":[[1,1,1,4]]}
[]
[null,"Inserting Image Using VBA Code"]
[]
[null,"Logo Name","Logo",null,"Status"]
[null,"exceldemy-logo-diamond",null,null,"Yes"]
[null,"Exceldemy-logo-small"]
[null,"Exceldemy-logo-old"]