{"text_format":"1","workbook":"xlsx","n_sheets":5,"sheets":["Table of contents","TOC","Employee History 1","Sales History-June 2","Sales History-July 3"],"not_rendered":{"charts":0,"images":0,"macros":1,"external_links":0,"defined_names":1,"comments":0,"pivot_tables":0},"unopened":[],"bounds":{"document_bytes":16777216,"sheet_cells":100000,"rows_first":2000,"rows_last":500,"rows_between":2000,"halvings":0,"cell_chars":16384,"cell_head_chars":4096},"cells_cut":0,"cells_raw":0,"read":"whole","date_system":"1900"}

{"sheet":"Table of contents","index":0,"n_rows":10,"n_cols":2,"rows_kept":10,"cut":false,"hidden":false,"merged":[]}
[]
[null,"Table of contents"]
[]
[null,"TOC"]
[]
[null,"Employee History 1"]
[]
[null,"Sales History-June 2"]
[]
[null,"Sales History-July 3"]

{"sheet":"TOC","index":1,"n_rows":7,"n_cols":2,"rows_kept":7,"cut":false,"hidden":false,"merged":[[1,1,1,3]]}
[]
[null,"Table of Contents"]
[]
[null,{"$f":"IF(ROW(A2)>_xlfn.SHEETS(),REPT(NOW(),),SUBSTITUTE(HYPERLINK(\"#'\"&TRIM(RIGHT(SUBSTITUTE(SUBSTITUTE(INDEX(WorksheetNames,ROW(A2)),\" \",CHAR(255)),\"]\",REPT(\" \",32)),32))&\"'!A1\",TRIM(RIGHT(SUBSTITUTE(SUBSTITUTE(INDEX(WorksheetNames,ROW(A2)),\" \",CHAR(255)),\"]\",REPT(\" \",32)),32))),CHAR(255),\" \"))","v":"TOC"}]
[null,{"$f":"IF(ROW(A3)>_xlfn.SHEETS(),REPT(NOW(),),SUBSTITUTE(HYPERLINK(\"#'\"&TRIM(RIGHT(SUBSTITUTE(SUBSTITUTE(INDEX(WorksheetNames,ROW(A3)),\" \",CHAR(255)),\"]\",REPT(\" \",32)),32))&\"'!A1\",TRIM(RIGHT(SUBSTITUTE(SUBSTITUTE(INDEX(WorksheetNames,ROW(A3)),\" \",CHAR(255)),\"]\",REPT(\" \",32)),32))),CHAR(255),\" \"))","v":"Employee History 1"}]
[null,{"$f":"IF(ROW(A4)>_xlfn.SHEETS(),REPT(NOW(),),SUBSTITUTE(HYPERLINK(\"#'\"&TRIM(RIGHT(SUBSTITUTE(SUBSTITUTE(INDEX(WorksheetNames,ROW(A4)),\" \",CHAR(255)),\"]\",REPT(\" \",32)),32))&\"'!A1\",TRIM(RIGHT(SUBSTITUTE(SUBSTITUTE(INDEX(WorksheetNames,ROW(A4)),\" \",CHAR(255)),\"]\",REPT(\" \",32)),32))),CHAR(255),\" \"))","v":"Sales History-June 2"}]
[null,{"$f":"IF(ROW(A5)>_xlfn.SHEETS(),REPT(NOW(),),SUBSTITUTE(HYPERLINK(\"#'\"&TRIM(RIGHT(SUBSTITUTE(SUBSTITUTE(INDEX(WorksheetNames,ROW(A5)),\" \",CHAR(255)),\"]\",REPT(\" \",32)),32))&\"'!A1\",TRIM(RIGHT(SUBSTITUTE(SUBSTITUTE(INDEX(WorksheetNames,ROW(A5)),\" \",CHAR(255)),\"]\",REPT(\" \",32)),32))),CHAR(255),\" \"))","v":"Sales History-July 3"}]

{"sheet":"Employee History 1","index":2,"n_rows":14,"n_cols":6,"rows_kept":14,"cut":false,"hidden":false,"merged":[[1,1,1,5]]}
[]
[null,"Employee History"]
[]
[null,"ID","Country","Name","Field of Specialization","Degree"]
[null,1,"USA","Anna","Marketing","BBA"]
[null,2,"Italy","Micheal","Management","BBA"]
[null,3,"Ireland","Bill","Economics","Hons'"]
[null,4,"Scotland","George","Customer Relations","BBA"]
[null,5,"Malaysia","Phyllis","Finance","Hons'"]
[null,6,"India","James","Marketing","BBA"]
[null,7,"Germany","Alice","Economics","Hons'"]
[null,8,"Russia","Darsha","Management","BBA"]
[null,9,"USA","Thomas","Customer Relations","BBA"]
[null,10,"Scotland","Ben","Finance","Hons'"]

{"sheet":"Sales History-June 2","index":3,"n_rows":14,"n_cols":6,"rows_kept":14,"cut":false,"hidden":false,"merged":[[1,1,1,5]]}
[]
[null,"Sales History-June"]
[]
[null,"ID","Name","Target Sales","Sales Amouunt","Collected Amount"]
[null,1,"Anna",5000,6000,3500]
[null,2,"Micheal",3800,4000,4000]
[null,3,"Bill",4500,3800,3800]
[null,4,"George",7300,9000,5000]
[null,5,"Phyllis",4200,5400,3400]
[null,6,"James",5000,6300,5000]
[null,7,"Alice",7500,7500,6300]
[null,8,"Darsha",4500,4500,4500]
[null,9,"Thomas",3600,3200,3200]
[null,10,"Ben",7800,7000,6000]

{"sheet":"Sales History-July 3","index":4,"n_rows":14,"n_cols":6,"rows_kept":14,"cut":false,"hidden":false,"merged":[[1,1,1,5]]}
[]
[null,"Sales History-July"]
[]
[null,"ID","Name","Target Sales","Sales Amouunt","Collected Amount"]
[null,1,"Anna",6000,5000,3500]
[null,2,"Micheal",4000,3800,4000]
[null,3,"Bill",3800,4500,3000]
[null,4,"George",9000,7300,5000]
[null,5,"Phyllis",5400,4200,3800]
[null,6,"James",6300,5000,5000]
[null,7,"Alice",7500,7500,6300]
[null,8,"Darsha",4500,4500,3000]
[null,9,"Thomas",3200,3600,3200]
[null,10,"Ben",7000,7800,6000]