{"text_format":"1","workbook":"xlsx","n_sheets":4,"sheets":["Data Set","Record","Monthly Leave Record","Annual Leave"],"not_rendered":{"charts":0,"images":0,"macros":1,"external_links":0,"defined_names":0,"comments":0,"pivot_tables":0},"unopened":[],"bounds":{"document_bytes":16777216,"sheet_cells":100000,"rows_first":2000,"rows_last":500,"rows_between":2000,"halvings":0,"cell_chars":16384,"cell_head_chars":4096},"cells_cut":0,"cells_raw":0,"read":"whole","date_system":"1900"}

{"sheet":"Data Set","index":0,"n_rows":16,"n_cols":8,"rows_kept":16,"cut":false,"hidden":false,"merged":[[1,1,1,7]]}
[]
[null,"Basic Information"]
[]
[null,"ID","Name",null,"Month",null,"Leave Type","Code"]
[null,"E-10001","Jessica",null,"2022-01-01",null,"Casual Leave","CL"]
[null,"E-10002","Henderson",null,"2022-02-01",null,"Sick Leave","SL"]
[null,"E-10003","Aaron",null,"2022-03-01",null,"Festive Leave","FL"]
[null,"E-10004","Mitchel",null,"2022-04-01",null,"Maternity Leave","ML"]
[null,"E-10005","John",null,"2022-05-01",null,"Unpaid Leave","UL"]
[null,"E-10006","Allisa",null,"2022-06-01"]
{"$rows_left_out":7}
{"sheet":"Record","index":1,"n_rows":20,"n_cols":6,"rows_kept":20,"cut":false,"hidden":false,"merged":[]}
[]
[null,null,null,"Leave Record"]
[]
[null,"Leave ID","Employee ID","Name","Date","Leave Code"]
[null,{"$f":"C5&E5","v":"E-1000144564"},"E-10001",{"$f":"IFERROR(VLOOKUP(C5,'Data Set'!$B$5:$C$14,2,0),\"\")","v":"Jessica"},"2022-01-03","SL"]
[null,{"$f":"C6&E6","v":"E-1000844574"},"E-10008",{"$f":"IFERROR(VLOOKUP(C6,'Data Set'!$B$5:$C$14,2,0),\"\")","v":"Joe"},"2022-01-13","UL"]
[null,"E-1000644593","E-10006",{"$f":"IFERROR(VLOOKUP(C7,'Data Set'!$B$5:$C$14,2,0),\"\")","v":"Allisa"},"2022-02-01","UL"]
[null,"E-1000644602","E-10006",{"$f":"IFERROR(VLOOKUP(C8,'Data Set'!$B$5:$C$14,2,0),\"\")","v":"Allisa"},"2022-02-10","FL"]
[null,"E-1000344620","E-10003",{"$f":"IFERROR(VLOOKUP(C9,'Data Set'!$B$5:$C$14,2,0),\"\")","v":"Aaron"},"2022-02-28","ML"]
[null,"E-1000944634","E-10009",{"$f":"IFERROR(VLOOKUP(C10,'Data Set'!$B$5:$C$14,2,0),\"\")","v":"Josef"},"2022-03-14","SL"]
{"$rows_left_out":11}
{"sheet":"Monthly Leave Record","index":2,"n_rows":18,"n_cols":40,"rows_kept":18,"cut":false,"hidden":false,"merged":[[5,39,7,39],[5,34,6,34],[5,35,6,35],[5,36,6,36],[5,37,6,37],[5,38,6,38],[3,14,3,17],[3,18,3,19],[5,3,5,33],[1,1,1,38],[5,1,7,1],[5,2,7,2],[3,3,3,4],[3,8,3,11]]}
[]
[null,"Monthwise Leave Record"]
[]
[null,null,null,"Month",null,null,null,null,"Month Number",null,null,null,2,null,"Starting of Month",null,null,null,{"$f":"INDEX('Data Set'!E5:E16,'Monthly Leave Record'!M4)","v":"2022-02-01"}]
[]
[null,"ID","Name",{"$f":"S4","v":"2022-02-01"},null,null,null,null,null,null,null,null,null,null,null,null,null,null,null,null,null,null,null,null,null,null,null,null,null,null,null,null,null,null,"Casual Leave","Sick Leave","Festive Leave","Maternity Leave","Unpaid Leave","Total"]
[null,null,null,{"$f":"S4","v":"2022-02-01"},{"$f":"IF(D7=\"\",\"\",IF(EOMONTH($S$4,0)<D7+1,\"\",D7+1))","v":"2022-02-02"},{"$f":"IF(E7=\"\",\"\",IF(EOMONTH($S$4,0)<E7+1,\"\",E7+1))","v":"2022-02-03"},"2022-02-04","2022-02-05","2022-02-06","2022-02-07","2022-02-08","2022-02-09","2022-02-10","2022-02-11","2022-02-12","2022-02-13","2022-02-14","2022-02-15","2022-02-16","2022-02-17","2022-02-18","2022-02-19","2022-02-20","2022-02-21","2022-02-22","2022-02-23","2022-02-24","2022-02-25","2022-02-26","2022-02-27","2022-02-28","","",""]
[null,null,null,{"$f":"TEXT(D7,\"ddd\")","v":"Tue"},{"$f":"TEXT(E7,\"ddd\")","v":"Wed"},"Thu","Fri","Sat","Sun","Mon","Tue","Wed","Thu","Fri","Sat","Sun","Mon","Tue","Wed","Thu","Fri","Sat","Sun","Mon","Tue","Wed","Thu","Fri","Sat","Sun","Mon","","","","CL","SL","FL","ML","UL"]
[null,"E-10001","Jessica",{"$f":"IFERROR(VLOOKUP($B9&D$7,Record!$B:$F,5,FALSE),\"\")","v":""},{"$f":"IFERROR(VLOOKUP($B9&E$7,Record!$B:$F,5,FALSE),\"\")","v":""},{"$f":"IFERROR(VLOOKUP($B9&F$7,Record!$B:$F,5,FALSE),\"\")","v":""},{"$f":"IFERROR(VLOOKUP($B9&G$7,Record!$B:$F,5,FALSE),\"\")","v":""},{"$f":"IFERROR(VLOOKUP($B9&H$7,Record!$B:$F,5,FALSE),\"\")","v":""},{"$f":"IFERROR(VLOOKUP($B9&I$7,Record!$B:$F,5,FALSE),\"\")","v":""},{"$f":"IFERROR(VLOOKUP($B9&J$7,Record!$B:$F,5,FALSE),\"\")","v":""},{"$f":"IFERROR(VLOOKUP($B9&K$7,Record!$B:$F,5,FALSE),\"\")","v":""},{"$f":"IFERROR(VLOOKUP($B9&L$7,Record!$B:$F,5,FALSE),\"\")","v":""},{"$f":"IFERROR(VLOOKUP($B9&M$7,Record!$B:$F,5,FALSE),\"\")","v":""},{"$f":"IFERROR(VLOOKUP($B9&N$7,Record!$B:$F,5,FALSE),\"\")","v":""},{"$f":"IFERROR(VLOOKUP($B9&O$7,Record!$B:$F,5,FALSE),\"\")","v":""},{"$f":"IFERROR(VLOOKUP($B9&P$7,Record!$B:$F,5,FALSE),\"\")","v":""},{"$f":"IFERROR(VLOOKUP($B9&Q$7,Record!$B:$F,5,FALSE),\"\")","v":""},{"$f":"IFERROR(VLOOKUP($B9&R$7,Record!$B:$F,5,FALSE),\"\")","v":""},{"$f":"IFERROR(VLOOKUP($B9&S$7,Record!$B:$F,5,FALSE),\"\")","v":""},{"$f":"IFERROR(VLOOKUP($B9&T$7,Record!$B:$F,5,FALSE),\"\")","v":""},{"$f":"IFERROR(VLOOKUP($B9&U$7,Record!$B:$F,5,FALSE),\"\")","v":""},{"$f":"IFERROR(VLOOKUP($B9&V$7,Record!$B:$F,5,FALSE),\"\")","v":""},{"$f":"IFERROR(VLOOKUP($B9&W$7,Record!$B:$F,5,FALSE),\"\")","v":""},{"$f":"IFERROR(VLOOKUP($B9&X$7,Record!$B:$F,5,FALSE),\"\")","v":""},{"$f":"IFERROR(VLOOKUP($B9&Y$7,Record!$B:$F,5,FALSE),\"\")","v":""},{"$f":"IFERROR(VLOOKUP($B9&Z$7,Record!$B:$F,5,FALSE),\"\")","v":""},{"$f":"IFERROR(VLOOKUP($B9&AA$7,Record!$B:$F,5,FALSE),\"\")","v":""},{"$f":"IFERROR(VLOOKUP($B9&AB$7,Record!$B:$F,5,FALSE),\"\")","v":""},{"$f":"IFERROR(VLOOKUP($B9&AC$7,Record!$B:$F,5,FALSE),\"\")","v":""},{"$f":"IFERROR(VLOOKUP($B9&AD$7,Record!$B:$F,5,FALSE),\"\")","v":""},{"$f":"IFERROR(VLOOKUP($B9&AE$7,Record!$B:$F,5,FALSE),\"\")","v":""},{"$f":"IFERROR(VLOOKUP($B9&AF$7,Record!$B:$F,5,FALSE),\"\")","v":""},{"$f":"IFERROR(VLOOKUP($B9&AG$7,Record!$B:$F,5,FALSE),\"\")","v":""},{"$f":"IFERROR(VLOOKUP($B9&AH$7,Record!$B:$F,5,FALSE),\"\")","v":""},{"$f":"COUNTIF($D9:$AE9,AI$8)","v":0},{"$f":"COUNTIF($D9:$AE9,AJ$8)","v":0},0,0,0,{"$f":"SUM(AI9:AM9)","v":0}]
[null,"E-10002","Henderson",{"$f":"IFERROR(VLOOKUP($B10&D$7,Record!$B:$F,5,FALSE),\"\")","v":""},{"$f":"IFERROR(VLOOKUP($B10&E$7,Record!$B:$F,5,FALSE),\"\")","v":""},{"$f":"IFERROR(VLOOKUP($B10&F$7,Record!$B:$F,5,FALSE),\"\")","v":""},{"$f":"IFERROR(VLOOKUP($B10&G$7,Record!$B:$F,5,FALSE),\"\")","v":""},{"$f":"IFERROR(VLOOKUP($B10&H$7,Record!$B:$F,5,FALSE),\"\")","v":""},{"$f":"IFERROR(VLOOKUP($B10&I$7,Record!$B:$F,5,FALSE),\"\")","v":""},{"$f":"IFERROR(VLOOKUP($B10&J$7,Record!$B:$F,5,FALSE),\"\")","v":""},{"$f":"IFERROR(VLOOKUP($B10&K$7,Record!$B:$F,5,FALSE),\"\")","v":""},{"$f":"IFERROR(VLOOKUP($B10&L$7,Record!$B:$F,5,FALSE),\"\")","v":""},{"$f":"IFERROR(VLOOKUP($B10&M$7,Record!$B:$F,5,FALSE),\"\")","v":""},{"$f":"IFERROR(VLOOKUP($B10&N$7,Record!$B:$F,5,FALSE),\"\")","v":""},{"$f":"IFERROR(VLOOKUP($B10&O$7,Record!$B:$F,5,FALSE),\"\")","v":""},{"$f":"IFERROR(VLOOKUP($B10&P$7,Record!$B:$F,5,FALSE),\"\")","v":""},{"$f":"IFERROR(VLOOKUP($B10&Q$7,Record!$B:$F,5,FALSE),\"\")","v":""},{"$f":"IFERROR(VLOOKUP($B10&R$7,Record!$B:$F,5,FALSE),\"\")","v":""},{"$f":"IFERROR(VLOOKUP($B10&S$7,Record!$B:$F,5,FALSE),\"\")","v":""},{"$f":"IFERROR(VLOOKUP($B10&T$7,Record!$B:$F,5,FALSE),\"\")","v":""},{"$f":"IFERROR(VLOOKUP($B10&U$7,Record!$B:$F,5,FALSE),\"\")","v":""},{"$f":"IFERROR(VLOOKUP($B10&V$7,Record!$B:$F,5,FALSE),\"\")","v":""},{"$f":"IFERROR(VLOOKUP($B10&W$7,Record!$B:$F,5,FALSE),\"\")","v":""},{"$f":"IFERROR(VLOOKUP($B10&X$7,Record!$B:$F,5,FALSE),\"\")","v":""},{"$f":"IFERROR(VLOOKUP($B10&Y$7,Record!$B:$F,5,FALSE),\"\")","v":""},{"$f":"IFERROR(VLOOKUP($B10&Z$7,Record!$B:$F,5,FALSE),\"\")","v":""},{"$f":"IFERROR(VLOOKUP($B10&AA$7,Record!$B:$F,5,FALSE),\"\")","v":""},{"$f":"IFERROR(VLOOKUP($B10&AB$7,Record!$B:$F,5,FALSE),\"\")","v":""},{"$f":"IFERROR(VLOOKUP($B10&AC$7,Record!$B:$F,5,FALSE),\"\")","v":""},{"$f":"IFERROR(VLOOKUP($B10&AD$7,Record!$B:$F,5,FALSE),\"\")","v":""},{"$f":"IFERROR(VLOOKUP($B10&AE$7,Record!$B:$F,5,FALSE),\"\")","v":""},{"$f":"IFERROR(VLOOKUP($B10&AF$7,Record!$B:$F,5,FALSE),\"\")","v":""},{"$f":"IFERROR(VLOOKUP($B10&AG$7,Record!$B:$F,5,FALSE),\"\")","v":""},{"$f":"IFERROR(VLOOKUP($B10&AH$7,Record!$B:$F,5,FALSE),\"\")","v":""},{"$f":"COUNTIF($D10:$AE10,AI$8)","v":0},0,0,0,0,{"$f":"SUM(AI10:AM10)","v":0}]
{"$rows_left_out":9}
{"sheet":"Annual Leave","index":3,"n_rows":18,"n_cols":9,"rows_kept":18,"cut":false,"hidden":false,"merged":[[1,1,1,8],[5,5,6,5],[5,6,6,6],[5,7,6,7],[5,8,7,8],[5,1,7,1],[5,2,7,2],[5,3,6,3],[5,4,6,4]]}
[]
[null,"Annual Leave Record"]
[]
[null,null,null,"Start","2022-01-01","End","2022-12-31"]
[]
[null,"ID","Name","Casual Leave","Sick Leave","Festive Leave","Maternity Leave","Unpaid Leave","Total"]
[]
[null,null,null,"CL","SL","FL","ML","UL"]
[null,"E-10001","Jessica",{"$f":"COUNTIFS(Record!$E:$E,\">=\"&'Annual Leave'!$E$4,Record!$E:$E,\"<=\"&'Annual Leave'!$G$4,Record!$C:$C,'Annual Leave'!$B9,Record!$F:$F,'Annual Leave'!D$8)","v":0},{"$f":"COUNTIFS(Record!$E:$E,\">=\"&'Annual Leave'!$E$4,Record!$E:$E,\"<=\"&'Annual Leave'!$G$4,Record!$C:$C,'Annual Leave'!$B9,Record!$F:$F,'Annual Leave'!E$8)","v":1},{"$f":"COUNTIFS(Record!$E:$E,\">=\"&'Annual Leave'!$E$4,Record!$E:$E,\"<=\"&'Annual Leave'!$G$4,Record!$C:$C,'Annual Leave'!$B9,Record!$F:$F,'Annual Leave'!F$8)","v":1},{"$f":"COUNTIFS(Record!$E:$E,\">=\"&'Annual Leave'!$E$4,Record!$E:$E,\"<=\"&'Annual Leave'!$G$4,Record!$C:$C,'Annual Leave'!$B9,Record!$F:$F,'Annual Leave'!G$8)","v":0},{"$f":"COUNTIFS(Record!$E:$E,\">=\"&'Annual Leave'!$E$4,Record!$E:$E,\"<=\"&'Annual Leave'!$G$4,Record!$C:$C,'Annual Leave'!$B9,Record!$F:$F,'Annual Leave'!H$8)","v":0},{"$f":"SUM(D9:H9)","v":2}]
[null,"E-10002","Henderson",{"$f":"COUNTIFS(Record!$E:$E,\">=\"&'Annual Leave'!$E$4,Record!$E:$E,\"<=\"&'Annual Leave'!$G$4,Record!$C:$C,'Annual Leave'!$B10,Record!$F:$F,'Annual Leave'!D$8)","v":0},{"$f":"COUNTIFS(Record!$E:$E,\">=\"&'Annual Leave'!$E$4,Record!$E:$E,\"<=\"&'Annual Leave'!$G$4,Record!$C:$C,'Annual Leave'!$B10,Record!$F:$F,'Annual Leave'!E$8)","v":0},{"$f":"COUNTIFS(Record!$E:$E,\">=\"&'Annual Leave'!$E$4,Record!$E:$E,\"<=\"&'Annual Leave'!$G$4,Record!$C:$C,'Annual Leave'!$B10,Record!$F:$F,'Annual Leave'!F$8)","v":0},{"$f":"COUNTIFS(Record!$E:$E,\">=\"&'Annual Leave'!$E$4,Record!$E:$E,\"<=\"&'Annual Leave'!$G$4,Record!$C:$C,'Annual Leave'!$B10,Record!$F:$F,'Annual Leave'!G$8)","v":0},{"$f":"COUNTIFS(Record!$E:$E,\">=\"&'Annual Leave'!$E$4,Record!$E:$E,\"<=\"&'Annual Leave'!$G$4,Record!$C:$C,'Annual Leave'!$B10,Record!$F:$F,'Annual Leave'!H$8)","v":0},{"$f":"SUM(D10:H10)","v":0}]
{"$rows_left_out":8}